FreeBSD-main-amd64-test - Build #22800 - Still Unstable

From: <>
Date: Mon, 16 Jan 2023 22:53:27 UTC
FreeBSD-main-amd64-test - Build #22800 (06b93ef8cda227d755d7f6cfa95d08c0ccc9dc2d) - Still Unstable

Build information:
Full change log:
Full build log:

Status explanation:
"Unstable" - some tests are suspected being broken by the following changes
"Still Unstable" - the failing test cases have not been fixed by these
                   following changes and this is a notification to note that
                   these changes have not been fully tested by the CI system

Change summaries:
(Those commits are likely but not certainly responsible)

7699e1386a16236002b26107ffd2dcbde375e197 by cy:
unbound: Vendor import 1.17.1

4dcc6baddb446d27a60e30ccc24b29d9e47b553a by pho:
stress2: Added a regression test

249526dace5d6f2696ed786f5a72a04a97b40252 by markj:
mixer(3): Add HEADNAME to TAILQ_HEAD declarations

06b93ef8cda227d755d7f6cfa95d08c0ccc9dc2d by cy:
unbound: Fix config.h

The failed test cases:

6 tests failed.
FAILED:  lib.libc.time.mktime_test.timegm_epoch

Error Message:
/usr/src/contrib/netbsd-tests/lib/libc/time/t_mktime.c:98: Expected errno 0, got 84, in t == (time_t)0


Error Message:
atf-check failed; see the output of the test for details

FAILED:  usr.sbin.etcupdate.preworld_test.main

Error Message:
Returned non-success exit status 1

FAILED:  sys.aio.aio_test.aio_socket_blocking_short_write

Error Message:
Test case body timed out

FAILED:  sys.aio.aio_test.aio_socket_blocking_short_write_vectored

Error Message:
Test case body timed out

FAILED:  sys.aio.aio_test.aio_socket_short_write_cancel

Error Message:
/usr/src/tests/sys/aio/aio_test.c:1396: aio_error(&iocb) == EINPROGRESS not met