FreeBSD-main-amd64-test - Build #22792 - Still Unstable

From: <>
Date: Fri, 13 Jan 2023 13:14:56 UTC
FreeBSD-main-amd64-test - Build #22792 (933be8d74b0471c8578a6ec965299383bc65138b) - Still Unstable

Build information:
Full change log:
Full build log:

Status explanation:
"Unstable" - some tests are suspected being broken by the following changes
"Still Unstable" - the failing test cases have not been fixed by these
                   following changes and this is a notification to note that
                   these changes have not been fully tested by the CI system

Change summaries:
(Those commits are likely but not certainly responsible)

9c041b450d5e604c3e35b5799b60a2c53795feef by kp:
pf: fix syncookies in conjunction with tcp fast port reuse

dc698b2cd59ebc08b05a261dbba8ee5707450d28 by kp:
pf tests: test fast port re-use with syncookies

933be8d74b0471c8578a6ec965299383bc65138b by kp:
pf: default syncookies to adaptive mode

The failed test cases:

6 tests failed.
FAILED:  lib.libc.time.mktime_test.timegm_epoch

Error Message:
/usr/src/contrib/netbsd-tests/lib/libc/time/t_mktime.c:98: Expected errno 0, got 84, in t == (time_t)0


Error Message:
atf-check failed; see the output of the test for details

FAILED:  usr.sbin.etcupdate.preworld_test.main

Error Message:
Returned non-success exit status 1

FAILED:  sys.aio.aio_test.aio_socket_blocking_short_write

Error Message:
Test case body timed out

FAILED:  sys.aio.aio_test.aio_socket_blocking_short_write_vectored

Error Message:
Test case body timed out

FAILED:  sys.aio.aio_test.aio_socket_short_write_cancel

Error Message:
/usr/src/tests/sys/aio/aio_test.c:1396: aio_error(&iocb) == EINPROGRESS not met