FreeBSD-main-amd64-test - Build #22789 - Still unstable

From: <>
Date: Fri, 13 Jan 2023 01:54:41 UTC
FreeBSD-main-amd64-test - Build #22789 (6e011d15031a73956912ca8b0e476484a58f905c) - Still unstable

Build information:
Full change log:
Full build log:

Status explanation:
"Unstable" - some tests are suspected being broken by the following changes
"Still Unstable" - the failing test cases have not been fixed by these
                   following changes and this is a notification to note that
                   these changes have not been fully tested by the CI system

Change summaries:
(Those commits are likely but not certainly responsible)

6e011d15031a73956912ca8b0e476484a58f905c by brooks:
makefs: don't needlessly require directories to exist

The failed test cases:

7 tests failed.
FAILED:  libexec.tftpd.functional.rrq_eaccess_v4

Error Message:
Test case body timed out

FAILED:  lib.libc.time.mktime_test.timegm_epoch

Error Message:
/usr/src/contrib/netbsd-tests/lib/libc/time/t_mktime.c:98: Expected errno 0, got 84, in t == (time_t)0


Error Message:
atf-check failed; see the output of the test for details

FAILED:  usr.sbin.etcupdate.preworld_test.main

Error Message:
Returned non-success exit status 1

FAILED:  sys.aio.aio_test.aio_socket_blocking_short_write

Error Message:
Test case body timed out

FAILED:  sys.aio.aio_test.aio_socket_blocking_short_write_vectored

Error Message:
Test case body timed out

FAILED:  sys.aio.aio_test.aio_socket_short_write_cancel

Error Message:
/usr/src/tests/sys/aio/aio_test.c:1396: aio_error(&iocb) == EINPROGRESS not met