FreeBSD-main-amd64-test - Build #22782 - Still Unstable

From: <>
Date: Thu, 12 Jan 2023 03:07:32 UTC
FreeBSD-main-amd64-test - Build #22782 (ad70f2e22ef29f94bf5208b3a9a2389575330b06) - Still Unstable

Build information:
Full change log:
Full build log:

Status explanation:
"Unstable" - some tests are suspected being broken by the following changes
"Still Unstable" - the failing test cases have not been fixed by these
                   following changes and this is a notification to note that
                   these changes have not been fully tested by the CI system

Change summaries:
(Those commits are likely but not certainly responsible)

39633fc1731c3feeed36aa452bbdfb7968a86383 by rmacklem:
nfscl: Improve NFSv4 error message for NFSERR_WRONGSEC

1c1783d66bc81ebd0c1304b1f613a9403c073915 by imp:
stand: Create common gen_setcurrdev and replace code

bf020787d5f1b4a1274135b49309f7e9ef3955e1 by imp:
stand: Move dev_cleanup into libsa

ad70f2e22ef29f94bf5208b3a9a2389575330b06 by imp:
stand: create common set_currdev

The failed test cases:

6 tests failed.
FAILED:  lib.libc.time.mktime_test.timegm_epoch

Error Message:
/usr/src/contrib/netbsd-tests/lib/libc/time/t_mktime.c:98: Expected errno 0, got 84, in t == (time_t)0


Error Message:
atf-check failed; see the output of the test for details

FAILED:  usr.sbin.etcupdate.preworld_test.main

Error Message:
Returned non-success exit status 1

FAILED:  sys.aio.aio_test.aio_socket_blocking_short_write

Error Message:
Test case body timed out

FAILED:  sys.aio.aio_test.aio_socket_blocking_short_write_vectored

Error Message:
Test case body timed out

FAILED:  sys.aio.aio_test.aio_socket_short_write_cancel

Error Message:
/usr/src/tests/sys/aio/aio_test.c:1396: aio_error(&iocb) == EINPROGRESS not met