FreeBSD-main-amd64-test - Build #22769 - Still Unstable

From: <>
Date: Mon, 09 Jan 2023 20:10:30 UTC
FreeBSD-main-amd64-test - Build #22769 (dd2b23006caa2323a12749dfc0d831a26a79bc5b) - Still Unstable

Build information:
Full change log:
Full build log:

Status explanation:
"Unstable" - some tests are suspected being broken by the following changes
"Still Unstable" - the failing test cases have not been fixed by these
                   following changes and this is a notification to note that
                   these changes have not been fully tested by the CI system

Change summaries:
(Those commits are likely but not certainly responsible)

0eccd618a36aed1fb33d2f712e6624fdf111406d by emaste:
pkgbase: share rules for packages without pkgdeps

dd2b23006caa2323a12749dfc0d831a26a79bc5b by glebius:
fuser: fix loop over kinfo_proc array

The failed test cases:

5 tests failed.
FAILED:  sys.netinet6.lpm6.lpm6_test2_success

Error Message:
atf-check failed; see the output of the test for details

FAILED:  usr.sbin.etcupdate.preworld_test.main

Error Message:
Returned non-success exit status 1

FAILED:  sys.aio.aio_test.aio_socket_blocking_short_write

Error Message:
Test case body timed out

FAILED:  sys.aio.aio_test.aio_socket_blocking_short_write_vectored

Error Message:
Test case body timed out

FAILED:  sys.aio.aio_test.aio_socket_short_write_cancel

Error Message:
/usr/src/tests/sys/aio/aio_test.c:1396: aio_error(&iocb) == EINPROGRESS not met