FreeBSD-main-amd64-test - Build #22765 - Still Unstable

From: <>
Date: Sun, 08 Jan 2023 06:36:56 UTC
FreeBSD-main-amd64-test - Build #22765 (4ffe60e6833e22f304e63212cc3b3984e3cf643f) - Still Unstable

Build information:
Full change log:
Full build log:

Status explanation:
"Unstable" - some tests are suspected being broken by the following changes
"Still Unstable" - the failing test cases have not been fixed by these
                   following changes and this is a notification to note that
                   these changes have not been fully tested by the CI system

Change summaries:
(Those commits are likely but not certainly responsible)

4ffe60e6833e22f304e63212cc3b3984e3cf643f by ganbold:
Add Combo PHY, RK817, Syr827, tcs4525 pmic devices to Rockchip specific

The failed test cases:

4 tests failed.
FAILED:  usr.sbin.etcupdate.preworld_test.main

Error Message:
Returned non-success exit status 1

FAILED:  sys.aio.aio_test.aio_socket_blocking_short_write

Error Message:
Test case body timed out

FAILED:  sys.aio.aio_test.aio_socket_blocking_short_write_vectored

Error Message:
Test case body timed out

FAILED:  sys.aio.aio_test.aio_socket_short_write_cancel

Error Message:
/usr/src/tests/sys/aio/aio_test.c:1396: aio_error(&iocb) == EINPROGRESS not met