FreeBSD-main-amd64-test - Build #22754 - Still unstable

From: <>
Date: Fri, 06 Jan 2023 13:54:54 UTC
FreeBSD-main-amd64-test - Build #22754 (d4ac5aa33457a7a199fd205d77654dd17620b53e) - Still unstable

Build information:
Full change log:
Full build log:

Status explanation:
"Unstable" - some tests are suspected being broken by the following changes
"Still Unstable" - the failing test cases have not been fixed by these
                   following changes and this is a notification to note that
                   these changes have not been fully tested by the CI system

Change summaries:
(Those commits are likely but not certainly responsible)

90737b632ee50f5275ea12498841883f7d739267 by ganbold:
Use BSD-2-Clause for the SPDX license id as  -FreeBSD variant has been

d4ac5aa33457a7a199fd205d77654dd17620b53e by des:
Missed skey(4), a copy of opie(4).

The failed test cases:

4 tests failed.
FAILED:  usr.sbin.etcupdate.preworld_test.main

Error Message:
Returned non-success exit status 1

FAILED:  sys.aio.aio_test.aio_socket_blocking_short_write

Error Message:
Test case body timed out

FAILED:  sys.aio.aio_test.aio_socket_blocking_short_write_vectored

Error Message:
Test case body timed out

FAILED:  sys.aio.aio_test.aio_socket_short_write_cancel

Error Message:
/usr/src/tests/sys/aio/aio_test.c:1396: aio_error(&iocb) == EINPROGRESS not met