FreeBSD-main-amd64-test - Build #22748 - Still Unstable

From: <>
Date: Thu, 05 Jan 2023 20:19:28 UTC
FreeBSD-main-amd64-test - Build #22748 (26bdd35c39d8de2672fac8903a161699ffe38a82) - Still Unstable

Build information:
Full change log:
Full build log:

Status explanation:
"Unstable" - some tests are suspected being broken by the following changes
"Still Unstable" - the failing test cases have not been fixed by these
                   following changes and this is a notification to note that
                   these changes have not been fully tested by the CI system

Change summaries:
(Those commits are likely but not certainly responsible)

26bdd35c39d8de2672fac8903a161699ffe38a82 by rrs:
rack and bbr not loading if TCP_RATELIMIT is not configured.

The failed test cases:

4 tests failed.
FAILED:  usr.sbin.etcupdate.preworld_test.main

Error Message:
Returned non-success exit status 1

FAILED:  sys.aio.aio_test.aio_socket_blocking_short_write

Error Message:
Test case body timed out

FAILED:  sys.aio.aio_test.aio_socket_blocking_short_write_vectored

Error Message:
Test case body timed out

FAILED:  sys.aio.aio_test.aio_socket_short_write_cancel

Error Message:
/usr/src/tests/sys/aio/aio_test.c:1396: aio_error(&iocb) == EINPROGRESS not met