FreeBSD-main-amd64-test - Build #22740 - Still Unstable

From: <>
Date: Wed, 04 Jan 2023 09:02:23 UTC
FreeBSD-main-amd64-test - Build #22740 (e898a3af97f97f74c0fb22032bbd163f7cc92a05) - Still Unstable

Build information:
Full change log:
Full build log:

Status explanation:
"Unstable" - some tests are suspected being broken by the following changes
"Still Unstable" - the failing test cases have not been fixed by these
                   following changes and this is a notification to note that
                   these changes have not been fully tested by the CI system

Change summaries:
(Those commits are likely but not certainly responsible)

e898a3af97f97f74c0fb22032bbd163f7cc92a05 by kevans:
grep: properly switch EOL indicator with -z

The failed test cases:

4 tests failed.
FAILED:  sys.kqueue.libkqueue.kqueue_test.main

Error Message:
Returned non-success exit status 1

FAILED:  sys.aio.aio_test.aio_socket_blocking_short_write

Error Message:
Test case body timed out

FAILED:  sys.aio.aio_test.aio_socket_blocking_short_write_vectored

Error Message:
Test case body timed out

FAILED:  sys.aio.aio_test.aio_socket_short_write_cancel

Error Message:
/usr/src/tests/sys/aio/aio_test.c:1396: aio_error(&iocb) == EINPROGRESS not met