FreeBSD-main-amd64-test - Build #22736 - Still Unstable

From: <>
Date: Tue, 03 Jan 2023 14:12:56 UTC
FreeBSD-main-amd64-test - Build #22736 (01143ba1189b5a2cbbe58cd3eea4c2eb22e04e57) - Still Unstable

Build information:
Full change log:
Full build log:

Status explanation:
"Unstable" - some tests are suspected being broken by the following changes
"Still Unstable" - the failing test cases have not been fixed by these
                   following changes and this is a notification to note that
                   these changes have not been fully tested by the CI system

Change summaries:
(Those commits are likely but not certainly responsible)

e4ef4c5d66c3680ed32a8b77f960c728ecf2a1b7 by mmel:
extres/phy: Add mode setting function.

17edacfb6e7cf7b5bf7678968038955d29293aef by pho:
stress2: Added a regression test

01143ba1189b5a2cbbe58cd3eea4c2eb22e04e57 by kib:
ifcapnv: fix IFCAP2 usage

The failed test cases:

3 tests failed.
FAILED:  sys.aio.aio_test.aio_socket_blocking_short_write

Error Message:
Test case body timed out

FAILED:  sys.aio.aio_test.aio_socket_blocking_short_write_vectored

Error Message:
Test case body timed out

FAILED:  sys.aio.aio_test.aio_socket_short_write_cancel

Error Message:
/usr/src/tests/sys/aio/aio_test.c:1396: aio_error(&iocb) == EINPROGRESS not met