FreeBSD-main-amd64-test - Build #22997 - Still Unstable

From: <>
Date: Thu, 16 Feb 2023 21:59:22 UTC
FreeBSD-main-amd64-test - Build #22997 (2924ae099a1e8ffc5b6040f3af5645aa54c0f629) - Still Unstable

Build information:
Full change log:
Full build log:

Status explanation:
"Unstable" - some tests are suspected being broken by the following changes
"Still Unstable" - the failing test cases have not been fixed by these
                   following changes and this is a notification to note that
                   these changes have not been fully tested by the CI system

Change summaries:
(Those commits are likely but not certainly responsible)

6d1c946e916845d01062e146aad5395410da1e54 by jrm:
libpcap: Make pcap/bpf.h a wrapper around system net/bpf.h

ccf2121d59ac51e1a0287d75262d48018d09cad6 by imp:
efivar: Try harder to find label's efimedia

49fd6affdbfe6af53f119ebb27ff5e5e292e1f67 by imp:
efivar: Allow NULL paths in build_dp

57d5ca4eeba6192e91044aad86fca4429966cfac by imp:
efivar: support device paths as well as mounted paths in path_to_dp

9a7915299484a767fbffc7234b8dc45c29954cca by imp:
efibootmgr: Add --efidev (-u) to discover UEFI's device path to a dev or

2b460910326c4f39068fe2158a0726dc3d362f68 by imp:
efivar: Really look for labels for the provider with right efimedia

2924ae099a1e8ffc5b6040f3af5645aa54c0f629 by mjg:
Revert "cpuset: add --count"

The failed test cases:

4 tests failed.
FAILED:  sys.fs.fusefs.symlink.main

Error Message:
Returned non-success exit status 1

FAILED:  sys.netinet6.lpm6.lpm6_test1_success

Error Message:
atf-check failed; see the output of the test for details

FAILED:  sys.netinet6.ndp.ndp_del_gu_success

Error Message:
atf-check failed; see the output of the test for details


Error Message:
/usr/tests/sys/netlink/ AssertionError