FreeBSD-stable-14-amd64-test - Build #276 - Still Unstable

From: <jenkins-admin_at_FreeBSD.org>
Date: Wed, 27 Dec 2023 16:36:23 UTC
FreeBSD-stable-14-amd64-test - Build #276 (0a6b61a89a68339e358fe5420994eb9f1b8898d8) - Still Unstable

Build information: https://ci.FreeBSD.org/job/FreeBSD-stable-14-amd64-test/276/
Full change log: https://ci.FreeBSD.org/job/FreeBSD-stable-14-amd64-test/276/changes
Full build log: https://ci.FreeBSD.org/job/FreeBSD-stable-14-amd64-test/276/console

Status explanation:
"Unstable" - some tests are suspected being broken by the following changes
"Still Unstable" - the failing test cases have not been fixed by these
                   following changes and this is a notification to note that
                   these changes have not been fully tested by the CI system

Change summaries:
(Those commits are likely but not certainly responsible)

b70cf00842c87a8440da9ba9ffc331dd3890eba4 by ram:
ocs_fc: IO timeout handling and error reporting fix.

0a6b61a89a68339e358fe5420994eb9f1b8898d8 by ram:
ocs_fc: Use xpt_path_sbuf() to copy the path to sbuf.



The failed test cases:

4 tests failed.
FAILED:  sys.netpfil.common.forward.pf_v4

Error Message:
atf-check failed; see the output of the test for details

FAILED:  sys.netpfil.pf.pfsync.defer

Error Message:
atf-check failed; see the output of the test for details

FAILED:  sys.netpfil.pf.scrub_pass.set_tos_v4

Error Message:
atf-check failed; see the output of the test for details

FAILED:  sys.netlink.test_netlink_message_writer.py.__test_cases_list__

Error Message:
Test program did not exit cleanly