FreeBSD-main-amd64-test - Build #24561 - Still Unstable

From: <>
Date: Fri, 22 Dec 2023 11:02:09 UTC
FreeBSD-main-amd64-test - Build #24561 (eb4d13126d85665197ed7efc17c1ab442daa70ea) - Still Unstable

Build information:
Full change log:
Full build log:

Status explanation:
"Unstable" - some tests are suspected being broken by the following changes
"Still Unstable" - the failing test cases have not been fixed by these
                   following changes and this is a notification to note that
                   these changes have not been fully tested by the CI system

Change summaries:
(Those commits are likely but not certainly responsible)

eb4d13126d85665197ed7efc17c1ab442daa70ea by pjd:
seq(1): Put separator only between the elements.

The failed test cases:

3 tests failed.
FAILED:  sys.netpfil.common.dummynet.ipfw_pls_gilbert

Error Message:
atf-check failed; see the output of the test for details

FAILED:  sys.netpfil.common.dummynet.pf_queue

Error Message:
We failed prioritisation 1 times

FAILED:  sys.netmap.ctrl-api-test.main

Error Message:
Returned non-success exit status 255