FreeBSD-main-amd64-test - Build #23455 - Still Unstable

From: <>
Date: Sun, 30 Apr 2023 22:15:07 UTC
FreeBSD-main-amd64-test - Build #23455 (8c48f4c5377ddc3dc55388f181f23111145f7099) - Still Unstable

Build information:
Full change log:
Full build log:

Status explanation:
"Unstable" - some tests are suspected being broken by the following changes
"Still Unstable" - the failing test cases have not been fixed by these
                   following changes and this is a notification to note that
                   these changes have not been fully tested by the CI system

Change summaries:
(Those commits are likely but not certainly responsible)

6a23843a4a6f2dae95a2029358468b697072b8d2 by kp:
libifconfig: fix carp key configuration

8c48f4c5377ddc3dc55388f181f23111145f7099 by se:
contrib/bc: import version 6.5.0

The failed test cases:

3 tests failed.
FAILED:  sys.netpfil.common.dummynet.pf_queue

Error Message:
We failed prioritisation 1 times

FAILED:  sys.file.path_test.path_pipe_fstatat

Error Message:
/usr/src/tests/sys/file/path_test.c:851: fstatat pipe: Not a directory

FAILED:  sys.netlink.test_snl.snl_parse_errmsg_capped

Error Message:
1 checks failed; see output for more details