FreeBSD-main-amd64-test - Build #23451 - Still Unstable

From: <>
Date: Sun, 30 Apr 2023 02:56:47 UTC
FreeBSD-main-amd64-test - Build #23451 (62dc21b10731bdba26dafeb51640c2048a3344a0) - Still Unstable

Build information:
Full change log:
Full build log:

Status explanation:
"Unstable" - some tests are suspected being broken by the following changes
"Still Unstable" - the failing test cases have not been fixed by these
                   following changes and this is a notification to note that
                   these changes have not been fully tested by the CI system

Change summaries:
(Those commits are likely but not certainly responsible)

04997e19e27b240f9fd253f3eb1053708ca99c51 by mckusick:
Additional output from dumpfs(8).

a2d1957bbcc87b499526df8d99ec7e1ddd2193c0 by mckusick:
Updates to UFS/FFS superblock integrity checks when reading a

62dc21b10731bdba26dafeb51640c2048a3344a0 by mckusick:
Additional validity checking in newfs(8).

The failed test cases:

3 tests failed.
FAILED:  sys.netinet6.ndp.ndp_del_gu_success

Error Message:
atf-check failed; see the output of the test for details

FAILED:  sys.file.path_test.path_pipe_fstatat

Error Message:
/usr/src/tests/sys/file/path_test.c:851: fstatat pipe: Not a directory

FAILED:  sys.netlink.test_snl.snl_parse_errmsg_capped

Error Message:
1 checks failed; see output for more details