FreeBSD-main-amd64-test - Build #23434 - Still Unstable

From: <>
Date: Wed, 26 Apr 2023 23:46:29 UTC
FreeBSD-main-amd64-test - Build #23434 (8c3b8c838674239538682b914bc1d7059255f116) - Still Unstable

Build information:
Full change log:
Full build log:

Status explanation:
"Unstable" - some tests are suspected being broken by the following changes
"Still Unstable" - the failing test cases have not been fixed by these
                   following changes and this is a notification to note that
                   these changes have not been fully tested by the CI system

Change summaries:
(Those commits are likely but not certainly responsible)

ce5a210997da3c4064cfe162e760379f1fa8b587 by kevans:
openzfs: arm64: implement kfpu_begin/kfpu_end

b73183d1a243d486e3889bd71800e94812f5fa17 by emaste:
ipv6: disable RFC 4620 nodeinfo by default

d09a955a605d03471c5ab7bd17b8a6186fdc148c by mjg:
zfs: Fix positive ABD size assertion in abd_verify().

c7e5e9dc41ad619c14601fe01ec749e475415fe0 by andrew:
arm: remove interrupt nesting by ipi_preempt()/ipi_hardclock()

d7e3b05b0de118e6940c032f0c207c452028f253 by andrew:
arm: remove passing trapframe to intr_ipi_dispatch()

2d7842d0bfb4257c5b1aba5c1e6f79e47735d71c by jhb:
arp/ndp: Use valid prototypes for function declarations with no

8c3b8c838674239538682b914bc1d7059255f116 by vmaffione:
netmap: pkt-gen: sync with upstream

The failed test cases:

3 tests failed.
FAILED:  sys.geom.class.gate.ggate_test.ggated

Error Message:
atf-check failed; see the output of the test for details

FAILED:  sys.posixshm.posixshm_test.largepage_mmap

Error Message:
Empty test result or no new line

FAILED:  sys.netlink.test_snl.snl_parse_errmsg_capped

Error Message:
1 checks failed; see output for more details