FreeBSD-main-amd64-test - Build #23432 - Still Unstable

From: <>
Date: Wed, 26 Apr 2023 17:42:59 UTC
FreeBSD-main-amd64-test - Build #23432 (e72f7ed43eefaf305c33c232bc2c33d997427f58) - Still Unstable

Build information:
Full change log:
Full build log:

Status explanation:
"Unstable" - some tests are suspected being broken by the following changes
"Still Unstable" - the failing test cases have not been fixed by these
                   following changes and this is a notification to note that
                   these changes have not been fully tested by the CI system

Change summaries:
(Those commits are likely but not certainly responsible)

80327535cfcadf8d0fedaf0e1c084688627c9785 by andrew:
Mark simplefb as depending on fdt

f8c451d2917425bc2f6615884b05e4d12b9b5ab5 by andrew:
Add vt_simplefb to the arm64 NOTES file

52199877a658842f81f1e997205ff26fb781a5a0 by melifaro:
arp: report successful deletion via netlink to mimic rtsock.

20b6945c7f542a76b8c8f9f962403303ccee4227 by melifaro:
netlink: fix IPv6 proxy ndp deletion.

795497bf3d2cdaf94c0054e1093567b65b569802 by tsoome:
pxeboot: bugs in pxe.h

727fd8a73df595453572b1f89e569d01c77eb63e by markj:
irdma: Silence an unused function warning

76f8584e49cf7eedaa2e1312593bf46c7225d79a by dchagin:
linux(4): Don't relie on process osreldata when testing features

e185d83fc48ba0f28896a986104c02203005b533 by dchagin:
linux(4): Use inlined LINUX_KERNVER for tests to improve readability

74ac712f72cfd6d7b3db3c9d3b72ccf2824aa183 by markj:
vmm: Dynamically allocate a couple of per-CPU state save areas

78cfa762ebf2afc821e49e41c7bc72cc9044c233 by markj:
callout: Move per-CPU callout state into the dpcpu region

e72f7ed43eefaf305c33c232bc2c33d997427f58 by markj:
buf: Dynamically allocate per-CPU buffer queues

The failed test cases:

3 tests failed.
FAILED:  sys.netpfil.common.dummynet.pf_queue

Error Message:
We failed prioritisation 1 times

FAILED:  sys.fs.fusefs.mknod.main

Error Message:
Returned non-success exit status 1

FAILED:  sys.netlink.test_snl.snl_parse_errmsg_capped

Error Message:
1 checks failed; see output for more details