FreeBSD-main-amd64-test - Build #23419 - Unstable

From: <>
Date: Tue, 25 Apr 2023 09:24:45 UTC
FreeBSD-main-amd64-test - Build #23419 (7959d80d99ae06ba06cbe7a206ef9bc513e4109b) - Unstable

Build information:
Full change log:
Full build log:

Status explanation:
"Unstable" - some tests are suspected being broken by the following changes
"Still Unstable" - the failing test cases have not been fixed by these
                   following changes and this is a notification to note that
                   these changes have not been fully tested by the CI system

Change summaries:
(Those commits are likely but not certainly responsible)

f565b4d6303f4798a2cb0dc51ef88de9e4a24047 by corvink:
bhyve: add helper struct for qemus acpi table loader

7959d80d99ae06ba06cbe7a206ef9bc513e4109b by corvink:
bhyve: make use of qemus acpi table loader

The failed test cases:

3 tests failed.
FAILED:  sys.fs.fusefs.symlink.main

Error Message:
Returned non-success exit status 1

FAILED:  sys.kern.ptrace_test.ptrace__follow_fork_both_attached_unrelated_debugger

Error Message:
/usr/src/tests/sys/kern/ptrace_test.c:594: WIFSTOPPED(status) not met

FAILED:  sys.posixshm.posixshm_test.largepage_mmap

Error Message:
Empty test result or no new line