FreeBSD-main-amd64-test - Build #23355 - Still Unstable

From: <>
Date: Sun, 16 Apr 2023 04:08:53 UTC
FreeBSD-main-amd64-test - Build #23355 (214909d6698da52cb8a2c4c0c591264aeb58b4c0) - Still Unstable

Build information:
Full change log:
Full build log:

Status explanation:
"Unstable" - some tests are suspected being broken by the following changes
"Still Unstable" - the failing test cases have not been fixed by these
                   following changes and this is a notification to note that
                   these changes have not been fully tested by the CI system

Change summaries:
(Those commits are likely but not certainly responsible)

757fc6666b876bb4cdbbc6fab735faa228d15489 by imp:
cam: Include stdbool.h for userland

214909d6698da52cb8a2c4c0c591264aeb58b4c0 by imp:
Revert "cam: fix up world compilation after previous"

The failed test cases:

4 tests failed.
FAILED:  libexec.tftpd.functional.rrq_netascii_v4

Error Message:
Test case body timed out

FAILED:  sys.fs.fusefs.mknod.main

Error Message:
Returned non-success exit status 1


Error Message:
Test program did not exit cleanly

FAILED:  sys.netinet6.fibs6.fibs6_ifroutes1_success

Error Message:
atf-check failed; see the output of the test for details