FreeBSD-main-amd64-test - Build #22172 - Still Unstable

From: <>
Date: Wed, 28 Sep 2022 12:25:01 UTC
FreeBSD-main-amd64-test - Build #22172 (5294bfa75166932497bab87a7e565d94a07341fb) - Still Unstable

Build information:
Full change log:
Full build log:

Status explanation:
"Unstable" - some tests are suspected being broken by the following changes
"Still Unstable" - the failing test cases have not been fixed by these
                   following changes and this is a notification to note that
                   these changes have not been fully tested by the CI system

Change summaries:
(Those commits are likely but not certainly responsible)

5294bfa75166932497bab87a7e565d94a07341fb by dougm:
sysctl_search_oid: remove all-NULL precondition

The failed test cases:

3 tests failed.
FAILED:  sys.fs.fusefs.mknod.main

Error Message:
Returned non-success exit status 1

FAILED:  sys.netpfil.common.dummynet.pf_queue

Error Message:
We failed prioritisation 1 times

FAILED:  usr.bin.file.file_test.contrib_file_tests

Error Message:
atf-check failed; see the output of the test for details