FreeBSD-main-amd64-test - Build #22153 - Still unstable

From: <>
Date: Mon, 26 Sep 2022 09:33:18 UTC
FreeBSD-main-amd64-test - Build #22153 (7a58bf04433f711e1db6b2c263d8d07c7fd0819b) - Still unstable

Build information:
Full change log:
Full build log:

Status explanation:
"Unstable" - some tests are suspected being broken by the following changes
"Still Unstable" - the failing test cases have not been fixed by these
                   following changes and this is a notification to note that
                   these changes have not been fully tested by the CI system

Change summaries:
(Those commits are likely but not certainly responsible)

7a58bf04433f711e1db6b2c263d8d07c7fd0819b by whu:
arm64: Enabling new hypercalls using HvCallSetVpRegisters and

The failed test cases:

3 tests failed.
FAILED:  sys.fs.fusefs.mknod.main

Error Message:
Returned non-success exit status 1

FAILED:  sys.netpfil.common.dummynet.pf_queue

Error Message:
We failed prioritisation 1 times

FAILED:  usr.bin.file.file_test.contrib_file_tests

Error Message:
atf-check failed; see the output of the test for details