FreeBSD-main-amd64-test - Build #22558 - Still Unstable

From: <>
Date: Wed, 30 Nov 2022 07:06:11 UTC
FreeBSD-main-amd64-test - Build #22558 (821549a9dfdf69f533feb84914b09450cd7311b6) - Still Unstable

Build information:
Full change log:
Full build log:

Status explanation:
"Unstable" - some tests are suspected being broken by the following changes
"Still Unstable" - the failing test cases have not been fixed by these
                   following changes and this is a notification to note that
                   these changes have not been fully tested by the CI system

Change summaries:
(Those commits are likely but not certainly responsible)

9f36c6bf1e4f29dec0e9b799b8fd00cb12de24f3 by philip:
Import tzdata 2022g

821549a9dfdf69f533feb84914b09450cd7311b6 by philip: add zoneinfo/America/Ciudad_Juarez

The failed test cases:

3 tests failed.
FAILED:  sys.kern.ktls_test.ktls_receive_aes128_cbc_1_2_sha256_bad_major

Error Message:
/usr/src/tests/sys/kern/ktls_test.c:1511: errno == expected_error not met

FAILED:  sys.kern.ktls_test.ktls_receive_aes256_cbc_1_1_sha1_bad_minor

Error Message:
/usr/src/tests/sys/kern/ktls_test.c:1511: errno == expected_error not met

FAILED:  sys.netinet6.lpm6.lpm6_test1_success

Error Message:
atf-check failed; see the output of the test for details