FreeBSD-main-amd64-test - Build #22555 - Still Unstable

From: <>
Date: Tue, 29 Nov 2022 22:44:59 UTC
FreeBSD-main-amd64-test - Build #22555 (e59fa9b2e7306e1ddc73e58628c3b64cf915e3ae) - Still Unstable

Build information:
Full change log:
Full build log:

Status explanation:
"Unstable" - some tests are suspected being broken by the following changes
"Still Unstable" - the failing test cases have not been fixed by these
                   following changes and this is a notification to note that
                   these changes have not been fully tested by the CI system

Change summaries:
(Those commits are likely but not certainly responsible)

b60164c9f4d823b3e9fbcb733f92d181c704f415 by imp:
stand/ofw: Use strpbrk instead of two strchrs

e59fa9b2e7306e1ddc73e58628c3b64cf915e3ae by imp:
newbus: Comment style nit

The failed test cases:

3 tests failed.
FAILED:  sys.fs.fusefs.mknod.main

Error Message:
Returned non-success exit status 1

FAILED:  sys.kern.ktls_test.ktls_receive_aes128_cbc_1_1_sha1_bad_minor

Error Message:
/usr/src/tests/sys/kern/ktls_test.c:1511: errno == expected_error not met

FAILED:  sys.kern.ktls_test.ktls_receive_aes256_gcm_1_2_oversized_record

Error Message:
/usr/src/tests/sys/kern/ktls_test.c:1511: errno == expected_error not met