FreeBSD-main-amd64-test - Build #22502 - Still Unstable

From: <>
Date: Thu, 17 Nov 2022 21:15:08 UTC
FreeBSD-main-amd64-test - Build #22502 (f556a05c49261af3d373c599d05fa250f3563b59) - Still Unstable

Build information:
Full change log:
Full build log:

Status explanation:
"Unstable" - some tests are suspected being broken by the following changes
"Still Unstable" - the failing test cases have not been fixed by these
                   following changes and this is a notification to note that
                   these changes have not been fully tested by the CI system

Change summaries:
(Those commits are likely but not certainly responsible)

bc5708c0e2fc7a936e06a7916c292023ebd53e2a by glebius:
counter: fix SYSCTL_COUNTER_U64_ARRAY type

9f9544fd92e606d13e228b713d3c4a7cad78575d by des:
tftp: Fix buffer overflow and fd leak in multi-file PUT.

bacb00ab408a2178d13f33d0cd9c6622913d80a9 by des:
tftpd: whitespace cleanup

a134a12b14e229c213e113f3c20a2e35c68a0337 by vangyzen:
Mark the debug.vnlru_nowhere sysctl as CTLFLAG_STATS

c15085278cb55bd3c1ea252adf5635bb6800b431 by andrew:
arm64 pmap: implement per-superpage locks

f556a05c49261af3d373c599d05fa250f3563b59 by cy:
heimdal: Fix: Too large time skew, client time 1970-01-01T01:00:00

The failed test cases:

4 tests failed.
FAILED:  sys.kern.ktls_test.ktls_receive_aes128_cbc_1_2_sha1_bad_minor

Error Message:
/usr/src/tests/sys/kern/ktls_test.c:1511: errno == expected_error not met

FAILED:  sys.kern.ktls_test.ktls_receive_aes128_gcm_1_2_oversized_record

Error Message:
/usr/src/tests/sys/kern/ktls_test.c:1511: errno == expected_error not met

FAILED:  sys.kern.ktls_test.ktls_receive_aes256_cbc_1_1_sha1_bad_minor

Error Message:
/usr/src/tests/sys/kern/ktls_test.c:1511: errno == expected_error not met

FAILED:  sys.kern.ktls_test.ktls_receive_aes256_cbc_1_2_sha1_bad_major

Error Message:
/usr/src/tests/sys/kern/ktls_test.c:1511: errno == expected_error not met