FreeBSD-main-amd64-test - Build #21526 - Still Unstable

From: <jenkins-admin_at_FreeBSD.org>
Date: Sun, 26 Jun 2022 01:45:51 UTC
FreeBSD-main-amd64-test - Build #21526 (0e87bab6b44b6cc12d25fd46954ee10121ee38fc) - Still Unstable

Build information: https://ci.FreeBSD.org/job/FreeBSD-main-amd64-test/21526/
Full change log: https://ci.FreeBSD.org/job/FreeBSD-main-amd64-test/21526/changes
Full build log: https://ci.FreeBSD.org/job/FreeBSD-main-amd64-test/21526/console

Status explanation:
"Unstable" - some tests are suspected being broken by the following changes
"Still Unstable" - the failing test cases have not been fixed by these
                   following changes and this is a notification to note that
                   these changes have not been fully tested by the CI system

Change summaries:
(Those commits are likely but not certainly responsible)

0e87bab6b44b6cc12d25fd46954ee10121ee38fc by melifaro:
routing: fix debug headers added in 6fa8ed43ee0c.



The failed test cases:

5 tests failed.
FAILED:  sys.fs.fusefs.mknod.main

Error Message:
Returned non-success exit status 1

FAILED:  sys.net.routing.test_rtsock_multipath.py.__test_cases_list__

Error Message:
Cannot find test program

FAILED:  sbin.growfs.legacy_test.main

Error Message:
6 of 19 tests failed

FAILED:  sys.geom.class.eli.resize_test.resize

Error Message:
atf-check failed; see the output of the test for details

FAILED:  usr.sbin.makefs.makefs_ffs_tests.autocalculate_image_size

Error Message:
atf-check failed; see the output of the test for details