FreeBSD-main-amd64-test - Build #21518 - Still Unstable

From: <>
Date: Fri, 24 Jun 2022 19:17:57 UTC
FreeBSD-main-amd64-test - Build #21518 (235d960aae754b1e4ace559050e94ae99c3a9a91) - Still Unstable

Build information:
Full change log:
Full build log:

Status explanation:
"Unstable" - some tests are suspected being broken by the following changes
"Still Unstable" - the failing test cases have not been fixed by these
                   following changes and this is a notification to note that
                   these changes have not been fully tested by the CI system

Change summaries:
(Those commits are likely but not certainly responsible)

3464958246273971a7f1e8e56773a589032c3ee4 by glebius:
unix/dgram: add a specific send method - uipc_sosend_dgram()

7e5b6b391e77e5a78da40af64dec171a92a00b60 by glebius:
unix/dgram: cleanup uipc_send of PF_UNIX/SOCK_DGRAM, step 1

f384a97c839ac6f8a51785a0e394154b320eca9b by glebius:
unix/dgram: cleanup uipc_send of PF_UNIX/SOCK_DGRAM, step 2

e3fbbf965e943119ebaac698fd2f8838acbc8b52 by glebius:
unix/dgram: add a specific receive method - uipc_soreceive_dgram

5dc8dd5f3ac564518b391ecd3e8ad9f4f3c786df by glebius:
unix/dgram: inline sbappendaddr_locked() into uipc_sosend_dgram()

315167c0de1a066614a936aa2c8954acb1a909eb by glebius:
unix: provide an option to return locked from unp_connectat()

a4fc41423f7d6e43287822212f0e9db7aab83d39 by glebius:
sockets: enable protocol specific socket buffers

a7444f807ec44ec5dc4db59b155982ae5b2970b0 by glebius:
unix/dgram: use minimal possible socket buffer for PF_UNIX/SOCK_DGRAM

9b841b0e239027a4966005cad4d32cbefb52e906 by glebius:
m_uiotombuf: write total memory length of the allocated chain in pkthdr

1093f16487a93c3ecdea910ca7249375873969da by glebius:
unix/dgram: reduce mbuf chain traversals in send(2) and recv(2)

458f475df8e5912609c14208c189414a8255c738 by glebius:
unix/dgram: smart socket buffers for one-to-many sockets

f9e62cbacc33987506332133bb076c8fe4fbe82d by glebius:
libc/syslog: fully deprecate and don't try to open "/dev/log"

ddc689051917e739a90d1335ff40591c7601397c by glebius:
libc/syslog: deprecate use of "/var/run/logpriv"

235d960aae754b1e4ace559050e94ae99c3a9a91 by glebius:
tests/unix_passfd: compile SOCK_STREAM and SOCK_DGRAM versions

The failed test cases:

4 tests failed.
FAILED:  sys.fs.fusefs.mknod.main

Error Message:
Returned non-success exit status 1

FAILED:  sbin.growfs.legacy_test.main

Error Message:
6 of 19 tests failed

FAILED:  sys.geom.class.eli.resize_test.resize

Error Message:
atf-check failed; see the output of the test for details

FAILED:  usr.sbin.makefs.makefs_ffs_tests.autocalculate_image_size

Error Message:
atf-check failed; see the output of the test for details