FreeBSD-main-amd64-test - Build #21509 - Still Unstable

From: <>
Date: Thu, 23 Jun 2022 21:28:35 UTC
FreeBSD-main-amd64-test - Build #21509 (a85bbbea91bddbd27d080fb2ad55a9f5c316adad) - Still Unstable

Build information:
Full change log:
Full build log:

Status explanation:
"Unstable" - some tests are suspected being broken by the following changes
"Still Unstable" - the failing test cases have not been fixed by these
                   following changes and this is a notification to note that
                   these changes have not been fully tested by the CI system

Change summaries:
(Those commits are likely but not certainly responsible)

d1aefbc04c84476fba06ff40e30464e0948b5ccf by mm:
zfs: fix static module build broken in 1f1e2261e

b076d8d54c2fd91a35aad6931d0bfa2aa0122036 by jhb:
mptable_hostb: Use legacy_get_pcibus() to fetch PCI bus number.

ca01879004d4fe49c2617f15048a52281963d0ac by mhorne:
if_dwc: consistently use if.c helper methods

27b39e58b39edb76a4bffdfe730edfe6bc22f329 by mhorne:
if_dwc: add detach method

3428997cb398767655a5651b76eb177a56e4b00a by mhorne:
if_dwc: recognize additional rgmii phy-modes

35c9edab4169f99de7e8fcada6d9b499c8405f87 by mhorne:
if_dwc: enable RX checksum offload feature

9718759043ec2ef36f12b15963194b866d731b5b by mhorne:
if_dwc: avoid duplicate packet counts

b93985c11a6e7c7dd5fcaca8db6f4847a0126991 by mhorne:
if_ffec: fix some misleading indentation

8757d0fca9e6a9e174bc87728e296e5338d30eb7 by mhorne:
if_ffec: free the dmamem allocation in detach

36a8572ee8f5db7ecb64bedc5738a363ec7cad36 by mhorne:
bus_if: provide a default null rescan method

8701571df9fad787f5833310cd696fe51e0cde6d by mhorne:
set_cputicker: use a bool

715276a08b08c1f30ee3313758a936a417939ef4 by mhorne:
riscv timer: cleanup

b82f4170fca86e9b41b613715852d4f225b26e3a by mhorne:
riscv timer: remove intermediate helper

33734a1f765f8d0ca6214918c3051d88b7b98764 by mhorne:
riscv timer: provide a function for cpu_ticks

3a4256dd86f01a35b076892841042bac0054fd64 by mhorne:
riscv timer: implement riscv_timer_et_stop()

cd9618bdb274375139080ee4e33ccbdc980513f3 by jhb:
bhyve: Snapshot impovements for 'blockif' backend

a85bbbea91bddbd27d080fb2ad55a9f5c316adad by jhb:
bhyve: Enable suspend/resume support for virtio-blk.

The failed test cases:

4 tests failed.
FAILED:  libexec.tftpd.functional.rrq_netascii_v6

Error Message:
Test case body timed out

FAILED:  sbin.growfs.legacy_test.main

Error Message:
6 of 19 tests failed

FAILED:  sys.geom.class.eli.resize_test.resize

Error Message:
atf-check failed; see the output of the test for details

FAILED:  usr.sbin.makefs.makefs_ffs_tests.autocalculate_image_size

Error Message:
atf-check failed; see the output of the test for details