FreeBSD-main-amd64-test - Build #21490 - Still Unstable

From: <>
Date: Tue, 21 Jun 2022 21:32:23 UTC
FreeBSD-main-amd64-test - Build #21490 (716924cb4832ea0a440daf09913a06f3166f243e) - Still Unstable

Build information:
Full change log:
Full build log:

Status explanation:
"Unstable" - some tests are suspected being broken by the following changes
"Still Unstable" - the failing test cases have not been fixed by these
                   following changes and this is a notification to note that
                   these changes have not been fully tested by the CI system

Change summaries:
(Those commits are likely but not certainly responsible)

54ae8e38f717f22963c2a87f48af6ecefc6b3e9b by jkim:
Import OpenSSL 1.1.1p

ec4d9b059ededda578be479c1d043c921907ed11 by jkim:
OpenSSL: Regen assembly file for OpenSSSL 1.1.1p

b4bdc8f9253d9db46f598f17cc546c2fe0f8038d by jkim:
OpenSSL: Regen manual pages for OpenSSL 1.1.1p

048ce0876f5421f70a6d348479bdeacdd8472bed by eugen:
adjkerntz(8):	detect extra jailed invokation to keep logs clean

df51e63eb5d7e34e7a79da144e962dbf5e7cdb4c by emaste:
Retire snd_ad1816 ISA sound card driver

aa83e9b189d67c8aa772fed4f9dd26cbcbff4e3f by emaste:
Retire snd_ess ISA sound card driver

754decef384a1ab30b39704264742fa33bfa365e by emaste:
Retire snd_gusc ISA sound card driver

5126e5eeeb5e07ceef3c809452a8c9f508b2d4d1 by emaste:
Retire snd_mss ISA sound card driver

716924cb4832ea0a440daf09913a06f3166f243e by emaste:
Retire snd_sbc ISA sound card driver

The failed test cases:

3 tests failed.
FAILED:  sbin.growfs.legacy_test.main

Error Message:
6 of 19 tests failed

FAILED:  sys.geom.class.eli.resize_test.resize

Error Message:
atf-check failed; see the output of the test for details

FAILED:  usr.sbin.makefs.makefs_ffs_tests.autocalculate_image_size

Error Message:
atf-check failed; see the output of the test for details