FreeBSD-main-amd64-test - Build #21479 - Still Unstable

From: <>
Date: Mon, 20 Jun 2022 19:19:54 UTC
FreeBSD-main-amd64-test - Build #21479 (6405997f45974bf6d25412f03c069ae048d74d51) - Still Unstable

Build information:
Full change log:
Full build log:

Status explanation:
"Unstable" - some tests are suspected being broken by the following changes
"Still Unstable" - the failing test cases have not been fixed by these
                   following changes and this is a notification to note that
                   these changes have not been fully tested by the CI system

Change summaries:
(Those commits are likely but not certainly responsible)

a932a5a649823fda05e89f7757cc59339da8e2aa by markj:
uma: Mark zeroed slabs as initialized for KMSAN

540da48d83fc148c1d34136da34ca8a2985a2a27 by markj:
vm_kern: Update KMSAN shadow maps when allocating kmem memory

c88f6908b40ce1bc0450db71f7fde141951d4c44 by markj:
bpf: Correct a comment

60b4ad4b6b561ac2d9129a3576a74db3607ad90c by markj:
bpf: Zero pad bytes preceding BPF headers

9553bc89dbc38a861a750ddc605cec0381788c5d by markj:
aio: Improve UMA usage

e123264e4dc394602f9fed2f0376204b5998d815 by markj:
vm: Fix racy checks for swap objects

6405997f45974bf6d25412f03c069ae048d74d51 by markj:
kevent.2: Add an xref to listen.2

The failed test cases:

3 tests failed.
FAILED:  sbin.growfs.legacy_test.main

Error Message:
6 of 19 tests failed

FAILED:  sys.geom.class.eli.resize_test.resize

Error Message:
atf-check failed; see the output of the test for details

FAILED:  usr.sbin.makefs.makefs_ffs_tests.autocalculate_image_size

Error Message:
atf-check failed; see the output of the test for details