FreeBSD-main-amd64-test - Build #21444 - Still Unstable

From: <>
Date: Wed, 15 Jun 2022 18:52:59 UTC
FreeBSD-main-amd64-test - Build #21444 (f9e62419f6daf226a7116be2601842f8f07b1928) - Still Unstable

Build information:
Full change log:
Full build log:

Status explanation:
"Unstable" - some tests are suspected being broken by the following changes
"Still Unstable" - the failing test cases have not been fixed by these
                   following changes and this is a notification to note that
                   these changes have not been fully tested by the CI system

Change summaries:
(Those commits are likely but not certainly responsible)

c6d092b5107d1a3acefa977828b8130c0505fe7b by markj:
pmap: Keep PTI page table pages busy

f6b799a86b8fb69013c10b072baed4ee6c8db2f9 by markj:
Fix the test used to wait for AP startup on x86, arm64, riscv

756bc3adc578077d530e7f64683d4fc8383030ce by markj:
kasan: Create a shadow for the bootstack prior to hammer_time()

9a964ad56182740ea09b87f7e6db4197c6756e48 by markj:
loader: Relax the check in is_kernphys_relocatable()

918505d0a084d18ad8e440c12c24b58231b33626 by mav:
hwpmc: Correct sysctl description.

f9e62419f6daf226a7116be2601842f8f07b1928 by mav:
hwpmc: Reenable PME before reenabling counters.

The failed test cases:

5 tests failed.
FAILED:  sys.fs.fusefs.symlink.main

Error Message:
Returned non-success exit status 1

FAILED:  sbin.dhclient.pcp.pcp

Error Message:
Test case cleanup did not terminate successfully

FAILED:  sbin.growfs.legacy_test.main

Error Message:
6 of 19 tests failed

FAILED:  sys.geom.class.eli.resize_test.resize

Error Message:
atf-check failed; see the output of the test for details

FAILED:  usr.sbin.makefs.makefs_ffs_tests.autocalculate_image_size

Error Message:
atf-check failed; see the output of the test for details