FreeBSD-main-amd64-test - Build #21438 - Still Unstable

From: <>
Date: Tue, 14 Jun 2022 21:25:38 UTC
FreeBSD-main-amd64-test - Build #21438 (73702c398046d8e01e6a0f5860b7e75cd37a9518) - Still Unstable

Build information:
Full change log:
Full build log:

Status explanation:
"Unstable" - some tests are suspected being broken by the following changes
"Still Unstable" - the failing test cases have not been fixed by these
                   following changes and this is a notification to note that
                   these changes have not been fully tested by the CI system

Change summaries:
(Those commits are likely but not certainly responsible)

2c1052053340af562e3121a41545419fa71e65f7 by jhb:
ktls_test: Add a helper function to close sockets.

2400a7b18f984664638cbf978687e6d2c00da2e7 by jhb:
ktls_test: Permit connecting to a remote echo server for tests.

ea4ebdcb4da94a30fae53da74eda302aaa4ff1f3 by jhb:
ktls_test: Permit an option to skip tests not using ifnet TLS.

1442fed7e25e9856464a0b0ce522ffc8cb473593 by jhb:
rc.d/ntpd: Restart ntpd when resuming from sleep.

628a4156a761d3daac8a4adc0e675c6e6064fd5a by jhb:
firmware: Map '@' in filenames to '_' in symbols.

6ab35c78fb5af66d586d4846e2d81e020331ad3f by jhb: Don't use return to exit.

73702c398046d8e01e6a0f5860b7e75cd37a9518 by jhb:
pmcannotate: Don't increment end address passed to objdump -d.

The failed test cases:

5 tests failed.
FAILED:  sys.fs.fusefs.symlink.main

Error Message:
Returned non-success exit status 1

FAILED:  sbin.dhclient.pcp.pcp

Error Message:
Test case cleanup did not terminate successfully

FAILED:  sbin.growfs.legacy_test.main

Error Message:
6 of 19 tests failed

FAILED:  sys.geom.class.eli.resize_test.resize

Error Message:
atf-check failed; see the output of the test for details

FAILED:  usr.sbin.makefs.makefs_ffs_tests.autocalculate_image_size

Error Message:
atf-check failed; see the output of the test for details