FreeBSD-main-amd64-test - Build #20491 - Still Unstable

From: <>
Date: Thu, 27 Jan 2022 10:45:22 UTC
FreeBSD-main-amd64-test - Build #20491 (735748f30aad80593e2b7f5f5f175d64484c5eeb) - Still Unstable

Build information:
Full change log:
Full build log:

Status explanation:
"Unstable" - some tests are suspected being broken by the following changes
"Still Unstable" - the failing test cases have not been fixed by these
                   following changes and this is a notification to note that
                   these changes have not been fully tested by the CI system

Change summaries:
(Those commits are likely but not certainly responsible)

735748f30aad80593e2b7f5f5f175d64484c5eeb by kp:
libpfctl: fix creatorid endianness

The failed test cases:

4 tests failed.
FAILED:  libexec.tftpd.functional.rrq_window_rfc7440_v4

Error Message:
Test case body timed out

FAILED:  sys.kern.ptrace_test.ptrace__follow_fork_both_attached_unrelated_debugger

Error Message:
/usr/src/tests/sys/kern/ptrace_test.c:601: WIFSTOPPED(status) not met


Error Message:
atf-check failed; see the output of the test for details

FAILED:  lib.libc.gen.posix_spawn_test.posix_spawnp_enoexec_fallback_null_argv0

Error Message:
/usr/src/lib/libc/tests/gen/posix_spawn_test.c:127: error == 0 not met