FreeBSD-main-amd64-test - Build #20449 - Still Unstable

From: <jenkins-admin_at_FreeBSD.org>
Date: Sun, 23 Jan 2022 22:09:02 UTC
FreeBSD-main-amd64-test - Build #20449 (8a5b4859c7fcefac7db611ef38450ef0a66d68a8) - Still Unstable

Build information: https://ci.FreeBSD.org/job/FreeBSD-main-amd64-test/20449/
Full change log: https://ci.FreeBSD.org/job/FreeBSD-main-amd64-test/20449/changes
Full build log: https://ci.FreeBSD.org/job/FreeBSD-main-amd64-test/20449/console

Status explanation:
"Unstable" - some tests are suspected being broken by the following changes
"Still Unstable" - the failing test cases have not been fixed by these
                   following changes and this is a notification to note that
                   these changes have not been fully tested by the CI system

Change summaries:
(Those commits are likely but not certainly responsible)

32e1beb19c7e8366ff6ad10d17769c6d0bdcc20a by mw:
ena-com: remove redundant declaration of ena_log_level.

41160c140e31c8ee0d7de4b2f7b9857e6cad57d0 by mw:
ena-com: remove CSUM_OFFLOAD from the plat file

2530eb1fa01bf28fbcfcdda58bd41e055dcb2e4a by mw:
ena-com: add NUMA allocations macros

2bbef9d95dc10a69a3c5813a517f6e8fe583539a by mw:
ena: properly handle IPv6 L4 checksum offload

b168d0c850f34e8178d815ba3a87de2657a02ca9 by mw:
ena: rework tx req_id validation logic

78554d0c707c9401dbae53fb8bc65d291a5a09a5 by mw:
ena: start timer service on attach

d10ec3ad7739a6f621d398d034632f68f647d72f by mw:
ena: do not call reset if device is unresponsive

95161adfcb9261af81015b9c8ec97a445a993e4c by mw:
ena: fix man page typos and update contact section

8a5b4859c7fcefac7db611ef38450ef0a66d68a8 by mw:
ena: update ENA version to v2.5.0



The failed test cases:

9 tests failed.
FAILED:  sys.ses.destructive.setelmstat

Error Message:
/usr/src/tests/sys/ses/destructive.c:57: r != 0

FAILED:  sys.ses.destructive.setencstat

Error Message:
/usr/src/tests/sys/ses/common.h:44: r != 0

FAILED:  sys.netpfil.pf.killstate.gateway

Error Message:
atf-check failed; see the output of the test for details

FAILED:  sys.netpfil.pf.killstate.id

Error Message:
atf-check failed; see the output of the test for details

FAILED:  sys.netpfil.pf.killstate.interface

Error Message:
atf-check failed; see the output of the test for details

FAILED:  sys.netinet.redirect.valid_redirect

Error Message:
atf-check failed; see the output of the test for details

FAILED:  sys.netpfil.pf.killstate.label

Error Message:
atf-check failed; see the output of the test for details

FAILED:  sys.netpfil.pf.killstate.multilabel

Error Message:
atf-check failed; see the output of the test for details

FAILED:  sys.netpfil.pf.killstate.v4

Error Message:
atf-check failed; see the output of the test for details