FreeBSD-main-amd64-test - Build #20445 - Still Unstable

From: <jenkins-admin_at_FreeBSD.org>
Date: Sat, 22 Jan 2022 21:28:02 UTC
FreeBSD-main-amd64-test - Build #20445 (2075d00fabb6d6a76c4829b9e027a496f04262b0) - Still Unstable

Build information: https://ci.FreeBSD.org/job/FreeBSD-main-amd64-test/20445/
Full change log: https://ci.FreeBSD.org/job/FreeBSD-main-amd64-test/20445/changes
Full build log: https://ci.FreeBSD.org/job/FreeBSD-main-amd64-test/20445/console

Status explanation:
"Unstable" - some tests are suspected being broken by the following changes
"Still Unstable" - the failing test cases have not been fixed by these
                   following changes and this is a notification to note that
                   these changes have not been fully tested by the CI system

Change summaries:
(Those commits are likely but not certainly responsible)

2075d00fabb6d6a76c4829b9e027a496f04262b0 by emaste:
hwpmc: drop 0x before %p printf format string



The failed test cases:

9 tests failed.
FAILED:  sys.ses.destructive.setelmstat

Error Message:
/usr/src/tests/sys/ses/destructive.c:57: r != 0

FAILED:  sys.ses.destructive.setencstat

Error Message:
/usr/src/tests/sys/ses/common.h:44: r != 0

FAILED:  sys.netpfil.pf.killstate.gateway

Error Message:
atf-check failed; see the output of the test for details

FAILED:  sys.netpfil.pf.killstate.id

Error Message:
atf-check failed; see the output of the test for details

FAILED:  sys.netpfil.pf.killstate.interface

Error Message:
atf-check failed; see the output of the test for details

FAILED:  sys.netinet.redirect.valid_redirect

Error Message:
atf-check failed; see the output of the test for details

FAILED:  sys.netpfil.pf.killstate.label

Error Message:
atf-check failed; see the output of the test for details

FAILED:  sys.netpfil.pf.killstate.multilabel

Error Message:
atf-check failed; see the output of the test for details

FAILED:  sys.netpfil.pf.killstate.v4

Error Message:
atf-check failed; see the output of the test for details