FreeBSD-main-amd64-test - Build #20320 - Still Unstable

From: <jenkins-admin_at_FreeBSD.org>
Date: Sat, 08 Jan 2022 00:09:23 UTC
FreeBSD-main-amd64-test - Build #20320 (adc88b9c01b5d7a51c896091b291afbdae42b02a) - Still Unstable

Build information: https://ci.FreeBSD.org/job/FreeBSD-main-amd64-test/20320/
Full change log: https://ci.FreeBSD.org/job/FreeBSD-main-amd64-test/20320/changes
Full build log: https://ci.FreeBSD.org/job/FreeBSD-main-amd64-test/20320/console

Status explanation:
"Unstable" - some tests are suspected being broken by the following changes
"Still Unstable" - the failing test cases have not been fixed by these
                   following changes and this is a notification to note that
                   these changes have not been fully tested by the CI system

Change summaries:
(Those commits are likely but not certainly responsible)

adc88b9c01b5d7a51c896091b291afbdae42b02a by emaste:
Build libclang also if LLDB is enabled



The failed test cases:

7 tests failed.
FAILED:  sys.netinet.redirect.valid_redirect

Error Message:
atf-check failed; see the output of the test for details

FAILED:  sys.netpfil.pf.killstate.gateway

Error Message:
atf-check failed; see the output of the test for details

FAILED:  sys.netpfil.pf.killstate.id

Error Message:
atf-check failed; see the output of the test for details

FAILED:  sys.netpfil.pf.killstate.interface

Error Message:
atf-check failed; see the output of the test for details

FAILED:  sys.netpfil.pf.killstate.label

Error Message:
atf-check failed; see the output of the test for details

FAILED:  sys.netpfil.pf.killstate.multilabel

Error Message:
atf-check failed; see the output of the test for details

FAILED:  sys.netpfil.pf.killstate.v4

Error Message:
atf-check failed; see the output of the test for details