FreeBSD-main-amd64-test - Build #22720 - Still unstable

From: <>
Date: Sat, 31 Dec 2022 06:01:07 UTC
FreeBSD-main-amd64-test - Build #22720 (4052b0e4b218f916b1f491a5ec9e41d38029215b) - Still unstable

Build information:
Full change log:
Full build log:

Status explanation:
"Unstable" - some tests are suspected being broken by the following changes
"Still Unstable" - the failing test cases have not been fixed by these
                   following changes and this is a notification to note that
                   these changes have not been fully tested by the CI system

Change summaries:
(Those commits are likely but not certainly responsible)

b6b352e4c7125e7d85ba382f05b1bad8454b6233 by bz:
LinuxKPI: 802.11: set sta supported legacy rates

5edde07c2aba02d0f7d30bbb0f203ec3e920e273 by bz:
LinuxKPI: 802.11: implement cfg80211_{get,put}_bss

5db817d864241232c51d654836996282c69f5e28 by bz:
LinuxKPI: 802.11: implement some *eleme/ie* lookup functions

13d87d92e401523f8d8e817720d40dc31cdfa444 by bz:
LinuxKPI: 802.11: implement cfg80211_get_ies_channel_number()

339119949660916aa40b1d67dbe002dd7eb0d709 by bz:
LinuxKPI: 802.11: implement ieee80211_get_hdrlen_from_skb()

c990500bf1028d55cdd370037c78ea808956e0fc by bz:
LinuxKPI; 802.11: update mac80211.h structures and fields

4b0af114370a5cb876012c381d3156c8fbdf7f40 by bz:
LinuxKPI: 802.11: move ieee80211_{unregister,restart}_hw out of header

55038a6306a570c9f2df89f5ad076de0f7d98152 by bz:
LinuxKPI: add simplified vesion of page_frag_cache

4052b0e4b218f916b1f491a5ec9e41d38029215b by bz:
LinuxKPI: pm.h add pm_sleep_ptr and DEFINE_SIMPLE_DEV_PM_OPS

The failed test cases:

4 tests failed.
FAILED:  sys.netinet6.proxy_ndp.pndp_neighbor_advert

Error Message:
atf-check failed; see the output of the test for details

FAILED:  sys.aio.aio_test.aio_socket_blocking_short_write

Error Message:
Test case body timed out

FAILED:  sys.aio.aio_test.aio_socket_blocking_short_write_vectored

Error Message:
Test case body timed out

FAILED:  sys.aio.aio_test.aio_socket_short_write_cancel

Error Message:
/usr/src/tests/sys/aio/aio_test.c:1396: aio_error(&iocb) == EINPROGRESS not met