FreeBSD-main-amd64-test - Build #22694 - Still Unstable

From: <>
Date: Fri, 23 Dec 2022 20:58:34 UTC
FreeBSD-main-amd64-test - Build #22694 (c89209c674f2c867a2a3a4cccd4760311399d7e4) - Still Unstable

Build information:
Full change log:
Full build log:

Status explanation:
"Unstable" - some tests are suspected being broken by the following changes
"Still Unstable" - the failing test cases have not been fixed by these
                   following changes and this is a notification to note that
                   these changes have not been fully tested by the CI system

Change summaries:
(Those commits are likely but not certainly responsible)

f2c8381fce9b87695ea448591e4412cbed38aa77 by melifaro:
netlink: add snl(3) - simple netlink library

f6f4ba0b05ab090f2bcc8865a63dfc378a8d8421 by melifaro:
netlink: fix netlink_snl_route.h header includes

c9313a0bad682351858e2e326cdb0f1d0bc2d1d8 by melifaro:
netlink: allow netlink to be build in the kernel

3e3875413128ff01f43b7ae8e0ca8db8d8d5efca by melifaro:
netlink: make snl(3) headers self-contained.

62a149bf621947fb7475c64b1ff04fe19fe16b29 by tcberner:
Add new rc: machine_id to generate /etc/machine-id

c89209c674f2c867a2a3a4cccd4760311399d7e4 by melifaro:
netlink: fix test-includes broken by f2c8381fce9b

The failed test cases:

3 tests failed.
FAILED:  sys.aio.aio_test.aio_socket_blocking_short_write

Error Message:
Test case body timed out

FAILED:  sys.aio.aio_test.aio_socket_blocking_short_write_vectored

Error Message:
Test case body timed out

FAILED:  sys.aio.aio_test.aio_socket_short_write_cancel

Error Message:
/usr/src/tests/sys/aio/aio_test.c:1396: aio_error(&iocb) == EINPROGRESS not met