FreeBSD-main-amd64-test - Build #22692 - Still Unstable

From: <>
Date: Fri, 23 Dec 2022 02:53:03 UTC
FreeBSD-main-amd64-test - Build #22692 (974be51b3f6070f9aae02e115ea6099f90bc9175) - Still Unstable

Build information:
Full change log:
Full build log:

Status explanation:
"Unstable" - some tests are suspected being broken by the following changes
"Still Unstable" - the failing test cases have not been fixed by these
                   following changes and this is a notification to note that
                   these changes have not been fully tested by the CI system

Change summaries:
(Those commits are likely but not certainly responsible)

f081a291a17de0e28e5b7f5adba312f0dcb59b0f by kib:
compat32: move struct ptrace_sc_ret32 definition from .c to .h

e6feeae2f915c76275b83b7365ae966a8f8dd016 by kib:
sys: rename td_coredump to td_remotereq

f0592b3c8dd8e172f0e7165c11371108d4d8838d by kib:
Add a thread debugging flag TDB_BOUNDARY

0e07241c372d7352537a4a786c96a580a721be3c by kib:
ptrace(2): explain how to select specific thread to operate on

140ceb5d956bb8795a77c23d3fd5ef047b0f3c68 by kib:
ptrace(2): add PT_SC_REMOTE remote syscall request

a98613f2389227effeb9d86e47e53ea01ecddfe5 by kib:
ptrace(2): document PT_SC_REMOTE

6403a140243d4f5377f589f93aeb44fe75ea8d59 by kib:
tools/test/ptrace: update scescx to do remote getpid(2) on each SCX

974be51b3f6070f9aae02e115ea6099f90bc9175 by kib:
Fixes for ptrace_syscallreq()

The failed test cases:

3 tests failed.
FAILED:  sys.aio.aio_test.aio_socket_blocking_short_write

Error Message:
Test case body timed out

FAILED:  sys.aio.aio_test.aio_socket_blocking_short_write_vectored

Error Message:
Test case body timed out

FAILED:  sys.aio.aio_test.aio_socket_short_write_cancel

Error Message:
/usr/src/tests/sys/aio/aio_test.c:1396: aio_error(&iocb) == EINPROGRESS not met