FreeBSD-main-amd64-test - Build #22683 - Still unstable

From: <>
Date: Thu, 22 Dec 2022 01:43:20 UTC
FreeBSD-main-amd64-test - Build #22683 (3266131908914b3a359571dae75194fe6d330c1d) - Still unstable

Build information:
Full change log:
Full build log:

Status explanation:
"Unstable" - some tests are suspected being broken by the following changes
"Still Unstable" - the failing test cases have not been fixed by these
                   following changes and this is a notification to note that
                   these changes have not been fully tested by the CI system

Change summaries:
(Those commits are likely but not certainly responsible)

79422a716d7cc7857e8b94ccea98ff68b38f6324 by jhibbits:
ixl: Fix a mechanical mess-up in DrvAPI conversion

ec22a3a259193685afaea1667a39266264c65fd3 by jhibbits:
DrvAPI: Trivial mechanical conversions for various drivers

3266131908914b3a359571dae75194fe6d330c1d by jhb:

The failed test cases:

4 tests failed.
FAILED:  sys.fs.fusefs.mknod.main

Error Message:
Returned non-success exit status 1

FAILED:  sys.aio.aio_test.aio_socket_blocking_short_write

Error Message:
Test case body timed out

FAILED:  sys.aio.aio_test.aio_socket_blocking_short_write_vectored

Error Message:
Test case body timed out

FAILED:  sys.aio.aio_test.aio_socket_short_write_cancel

Error Message:
/usr/src/tests/sys/aio/aio_test.c:1396: aio_error(&iocb) == EINPROGRESS not met