FreeBSD-main-amd64-test - Build #22677 - Still unstable

From: <>
Date: Wed, 21 Dec 2022 03:47:27 UTC
FreeBSD-main-amd64-test - Build #22677 (2e543af13ab3746c7626c53293c007c8747eff9d) - Still unstable

Build information:
Full change log:
Full build log:

Status explanation:
"Unstable" - some tests are suspected being broken by the following changes
"Still Unstable" - the failing test cases have not been fixed by these
                   following changes and this is a notification to note that
                   these changes have not been fully tested by the CI system

Change summaries:
(Those commits are likely but not certainly responsible)

54f3a781a2ff980034dfe13ff6323c96fc587f1b by jhb:
.github: Switch to v3 of actions/checkout.

2e543af13ab3746c7626c53293c007c8747eff9d by zlei:
geom_part: Fix potential integer overflow when checking size of the

The failed test cases:

3 tests failed.
FAILED:  sys.aio.aio_test.aio_socket_blocking_short_write

Error Message:
Test case body timed out

FAILED:  sys.aio.aio_test.aio_socket_blocking_short_write_vectored

Error Message:
Test case body timed out

FAILED:  sys.aio.aio_test.aio_socket_short_write_cancel

Error Message:
/usr/src/tests/sys/aio/aio_test.c:1396: aio_error(&iocb) == EINPROGRESS not met