FreeBSD-main-amd64-test - Build #22665 - Still unstable

From: <>
Date: Mon, 19 Dec 2022 10:47:42 UTC
FreeBSD-main-amd64-test - Build #22665 (8f7859e800d998e5518b4f0d6c9545106dc96f68) - Still unstable

Build information:
Full change log:
Full build log:

Status explanation:
"Unstable" - some tests are suspected being broken by the following changes
"Still Unstable" - the failing test cases have not been fixed by these
                   following changes and this is a notification to note that
                   these changes have not been fully tested by the CI system

Change summaries:
(Those commits are likely but not certainly responsible)

85dac03e30e6aebdf0808cd750cc5ab96efcb67c by mjg:
vfs: stop using NDFREE

269c564b90d3f95ac3afbd4bd1adad36681f2b93 by mjg:
vfs: retire NDFREE

65127e982b94caeada8864465ad09756a7e80125 by mjg:
nfs: stop using SAVESTART

8f874e92ebc9e75b5dd7935a042cf016be19fb38 by mjg:
vfs: make relookup take an additional argument

56da4aa5545f9fa968f1d924d01db8939c401c15 by mjg:
vfs: stop using SAVESTART for rename

8f7859e800d998e5518b4f0d6c9545106dc96f68 by mjg:
vfs: retire the now unused SAVESTART flag

The failed test cases:

3 tests failed.
FAILED:  sys.aio.aio_test.aio_socket_blocking_short_write

Error Message:
Test case body timed out

FAILED:  sys.aio.aio_test.aio_socket_blocking_short_write_vectored

Error Message:
Test case body timed out

FAILED:  sys.aio.aio_test.aio_socket_short_write_cancel

Error Message:
/usr/src/tests/sys/aio/aio_test.c:1396: aio_error(&iocb) == EINPROGRESS not met