FreeBSD-main-amd64-test - Build #22661 - Still Unstable

From: <>
Date: Sun, 18 Dec 2022 14:22:50 UTC
FreeBSD-main-amd64-test - Build #22661 (0e3c99cbed14bfde865fd9efb094ae520de35d55) - Still Unstable

Build information:
Full change log:
Full build log:

Status explanation:
"Unstable" - some tests are suspected being broken by the following changes
"Still Unstable" - the failing test cases have not been fixed by these
                   following changes and this is a notification to note that
                   these changes have not been fully tested by the CI system

Change summaries:
(Those commits are likely but not certainly responsible)

0e3c99cbed14bfde865fd9efb094ae520de35d55 by ganbold:
Fix/add compat strings for Rockchip RK356x GRF.

The failed test cases:

4 tests failed.
FAILED:  sys.geom.class.gate.ggate_test.ggated

Error Message:
atf-check failed; see the output of the test for details

FAILED:  sys.aio.aio_test.aio_socket_blocking_short_write

Error Message:
Test case body timed out

FAILED:  sys.aio.aio_test.aio_socket_blocking_short_write_vectored

Error Message:
Test case body timed out

FAILED:  sys.aio.aio_test.aio_socket_short_write_cancel

Error Message:
/usr/src/tests/sys/aio/aio_test.c:1396: aio_error(&iocb) == EINPROGRESS not met