FreeBSD-main-amd64-test - Build #22650 - Still Unstable

From: <>
Date: Fri, 16 Dec 2022 01:45:28 UTC
FreeBSD-main-amd64-test - Build #22650 (69542f26820b7edb8351398b36edda5299c1db56) - Still Unstable

Build information:
Full change log:
Full build log:

Status explanation:
"Unstable" - some tests are suspected being broken by the following changes
"Still Unstable" - the failing test cases have not been fixed by these
                   following changes and this is a notification to note that
                   these changes have not been fully tested by the CI system

Change summaries:
(Those commits are likely but not certainly responsible)

883d1742d3d74635afc3ae2d8208974ac51e3dd9 by jhb:
ktls_tests: Log more details when a test fails.

69542f26820b7edb8351398b36edda5299c1db56 by jhb:
ktls: Close a race with setting so_error when dropping a connection.

The failed test cases:

3 tests failed.
FAILED:  sys.aio.aio_test.aio_socket_blocking_short_write

Error Message:
Test case body timed out

FAILED:  sys.aio.aio_test.aio_socket_blocking_short_write_vectored

Error Message:
Test case body timed out

FAILED:  sys.aio.aio_test.aio_socket_short_write_cancel

Error Message:
/usr/src/tests/sys/aio/aio_test.c:1396: aio_error(&iocb) == EINPROGRESS not met