FreeBSD-main-amd64-test - Build #22647 - Still Unstable

From: <>
Date: Thu, 15 Dec 2022 13:52:36 UTC
FreeBSD-main-amd64-test - Build #22647 (3636a967f310e3380ff7d8d63728ca9e7a5b6ce2) - Still Unstable

Build information:
Full change log:
Full build log:

Status explanation:
"Unstable" - some tests are suspected being broken by the following changes
"Still Unstable" - the failing test cases have not been fixed by these
                   following changes and this is a notification to note that
                   these changes have not been fully tested by the CI system

Change summaries:
(Those commits are likely but not certainly responsible)

3636a967f310e3380ff7d8d63728ca9e7a5b6ce2 by melifaro:
route: allow RTM_CHANGE notifications in rt_routemsg().

The failed test cases:

4 tests failed.
FAILED:  sys.netpfil.common.dummynet.pf_queue

Error Message:
We failed prioritisation 1 times

FAILED:  sys.aio.aio_test.aio_socket_blocking_short_write

Error Message:
Test case body timed out

FAILED:  sys.aio.aio_test.aio_socket_blocking_short_write_vectored

Error Message:
Test case body timed out

FAILED:  sys.aio.aio_test.aio_socket_short_write_cancel

Error Message:
/usr/src/tests/sys/aio/aio_test.c:1396: aio_error(&iocb) == EINPROGRESS not met