FreeBSD-main-amd64-test - Build #22643 - Still Unstable

From: <>
Date: Wed, 14 Dec 2022 22:38:39 UTC
FreeBSD-main-amd64-test - Build #22643 (80f03e63d67ede8fedbed4bd6bf6b12ec2ab2cfb) - Still Unstable

Build information:
Full change log:
Full build log:

Status explanation:
"Unstable" - some tests are suspected being broken by the following changes
"Still Unstable" - the failing test cases have not been fixed by these
                   following changes and this is a notification to note that
                   these changes have not been fully tested by the CI system

Change summaries:
(Those commits are likely but not certainly responsible)

7a2c93b86ef75390a60a4b4d6e3911b36221dfbe by glebius:
sockets: provide sousrsend() that does socket specific error handling

c4a4b2633d975bd0813afca6b8e23ead29d80e82 by gallatin:
allocate inpcb aligned to cachelines

1cac76c93fb7f627fd9e304cbd99e8c8a2b8fce8 by gallatin:
vm: reduce lock contention when processing vm batchqueues

80f03e63d67ede8fedbed4bd6bf6b12ec2ab2cfb by melifaro:
netlink: improve interface handling

The failed test cases:

4 tests failed.
FAILED:  sys.aio.aio_test.aio_socket_blocking_short_write

Error Message:
Test case body timed out

FAILED:  sys.aio.aio_test.aio_socket_blocking_short_write_vectored

Error Message:
Test case body timed out

FAILED:  sys.aio.aio_test.aio_socket_short_write_cancel

Error Message:
/usr/src/tests/sys/aio/aio_test.c:1396: aio_error(&iocb) == EINPROGRESS not met

FAILED:  sys.kern.ktls_test.ktls_receive_aes128_gcm_1_3_bad_minor

Error Message:
/usr/src/tests/sys/kern/ktls_test.c:1587: errno == expected_error not met