FreeBSD-main-amd64-test - Build #22626 - Still Unstable

From: <>
Date: Tue, 13 Dec 2022 08:18:38 UTC
FreeBSD-main-amd64-test - Build #22626 (2e1e68cbaee3e74a89e9b63fdb180974a2bf4292) - Still Unstable

Build information:
Full change log:
Full build log:

Status explanation:
"Unstable" - some tests are suspected being broken by the following changes
"Still Unstable" - the failing test cases have not been fixed by these
                   following changes and this is a notification to note that
                   these changes have not been fully tested by the CI system

Change summaries:
(Those commits are likely but not certainly responsible)

0b75997f4c5a15f02e6d5eee981a1b752dd0fd59 by kib:
Add sizeof(7) manual page

2e1e68cbaee3e74a89e9b63fdb180974a2bf4292 by imp:
stand: Make ioctl declaration consistent

The failed test cases:

3 tests failed.
FAILED:  libexec.tftpd.functional.unknown_modes_v4

Error Message:
Test case body timed out

FAILED:  sys.kern.ktls_test.ktls_receive_aes128_gcm_1_2_oversized_record

Error Message:
/usr/src/tests/sys/kern/ktls_test.c:1587: errno == expected_error not met

FAILED:  sys.kern.ktls_test.ktls_receive_aes256_cbc_1_2_sha256_bad_major

Error Message:
/usr/src/tests/sys/kern/ktls_test.c:1587: errno == expected_error not met