FreeBSD-main-amd64-test - Build #22614 - Unstable

From: <>
Date: Fri, 09 Dec 2022 23:00:41 UTC
FreeBSD-main-amd64-test - Build #22614 (08b05de1e21a7f3720eb618613276e3f3ab665f3) - Unstable

Build information:
Full change log:
Full build log:

Status explanation:
"Unstable" - some tests are suspected being broken by the following changes
"Still Unstable" - the failing test cases have not been fixed by these
                   following changes and this is a notification to note that
                   these changes have not been fully tested by the CI system

Change summaries:
(Those commits are likely but not certainly responsible)

62be9ffd82fb1a03db5e04d32ab75550f1f4f2c7 by jhb:
vmm: VM_GET/SET_KERNEMU_DEV should run with the vCPU locked.

91980db1beecd52e34a1550a247e374cfcc746a2 by jhb:
vmm: Don't lock a vCPU for VM_PPTDEV_MSI[X].

d212d6ebb4ea3b3e9c3964c1a6d3f41817e437e1 by jhb:
vmm: Avoid infinite loop in vcpu_lock_all error case.

af3b48e101986fb0840739f8c4bb3195e78008b1 by jhb:
vmm: Free vCPUs when destroying them.

34781da505fd06fc7cdf18e6e0c0eb187391d2c7 by jhb:
bhyve: Remove unused argument from pci_nvme_handle_doorbell.

0857e5555d77357e34ea6d70b28ead6335e41d33 by jhb:
bhyve: Pass a vCPU ID of 0 to vm_setup_pptdev_msi*.

78c2cd83eccac0ebd23ebd15df77ee33a5781a6e by jhb:
bhyve: Remove unused vcpu argument from PCI read/write methods.

08b05de1e21a7f3720eb618613276e3f3ab665f3 by jhb:
bhyve: Remove the unused vcpu argument from all of the I/O port

The failed test cases:

5 tests failed.
FAILED:  sys.kern.ktls_test.ktls_receive_aes128_cbc_1_2_sha384_bad_major

Error Message:
/usr/src/tests/sys/kern/ktls_test.c:1587: errno == expected_error not met

FAILED:  sys.kern.ktls_test.ktls_receive_aes128_cbc_1_2_sha384_bad_minor

Error Message:
/usr/src/tests/sys/kern/ktls_test.c:1587: errno == expected_error not met

FAILED:  sys.kern.ktls_test.ktls_receive_aes128_gcm_1_2_bad_major

Error Message:
/usr/src/tests/sys/kern/ktls_test.c:1587: errno == expected_error not met

FAILED:  sys.kern.ktls_test.ktls_receive_aes256_cbc_1_1_sha1_bad_major

Error Message:
/usr/src/tests/sys/kern/ktls_test.c:1587: errno == expected_error not met

FAILED:  sys.kqueue.libkqueue.kqueue_test.main

Error Message:
Returned non-success exit status 1