FreeBSD-main-amd64-test - Build #22612 - Still Unstable

From: <>
Date: Fri, 09 Dec 2022 16:30:56 UTC
FreeBSD-main-amd64-test - Build #22612 (91ddfd352f59beb8262f98c2e8a22722207e5aa6) - Still Unstable

Build information:
Full change log:
Full build log:

Status explanation:
"Unstable" - some tests are suspected being broken by the following changes
"Still Unstable" - the failing test cases have not been fixed by these
                   following changes and this is a notification to note that
                   these changes have not been fully tested by the CI system

Change summaries:
(Those commits are likely but not certainly responsible)

7ec4b29b086b67b8c778d2bc50c90e9e0655c03e by kib:
uiomove_object: hide diagnostic under bootverbose

e77f2f9dc683bb5ac725c5844fc36c831138e841 by kib:
tmpfs: minor style

83aff0f08c525ea3c394f3dd6598665cd369d53c by kib:
Add 'show tmpfs' ddb command

baa1ccceefdf4954a88e54ca18c6ab1762faa326 by kib:
Make swap_pager_freespace() global

d9dc64f1589360f2062ad92d63f69e13121e472a by kib:
tmpfs: make vm_object point to the tmpfs node instead of vnode

d537d1f12e8829faccd395115193b03b578f1176 by kib:
vm_pager: add methods for page insertion and removal notifications

ec201dddfbddd3a77dd3f3afc9b007d0e13e7ad1 by kib:
vm_pager: add method to veto page allocation

cd086696c2cb6d23bac3bc749836d36a9280ae98 by kib:
vm_pager_allocate(): override resulting object type

37aea2649ff707f23d35309d882b38e9ac818e42 by kib:
tmpfs: for used pages, account really allocated pages, instead of file

0919f29d91031cf42eca99266bffe7b0faef8f1b by kib:
shmfd: account for the actually allocated pages

1bbc5101348b9ca23cef6bde6c22751e69e8cf91 by kib:
posixshmcontrol(1): for regular shmfd, report used pages number

f1f030246f3e72af0ee3ba82a0e8b9f6d9559b69 by kib:
posixshm_test: small style fixes

91ddfd352f59beb8262f98c2e8a22722207e5aa6 by kib:
posixshm_test: add naive page accounting test

The failed test cases:

4 tests failed.
FAILED:  sys.kern.ktls_test.ktls_receive_aes256_cbc_1_2_sha1_bad_minor

Error Message:
/usr/src/tests/sys/kern/ktls_test.c:1587: errno == expected_error not met

FAILED:  sys.kern.ktls_test.ktls_receive_aes256_cbc_1_2_sha256_bad_minor

Error Message:
/usr/src/tests/sys/kern/ktls_test.c:1587: errno == expected_error not met

FAILED:  sys.kern.ktls_test.ktls_receive_aes256_cbc_1_2_sha256_oversized_record

Error Message:
/usr/src/tests/sys/kern/ktls_test.c:1587: errno == expected_error not met

FAILED:  sys.kern.ktls_test.ktls_receive_aes256_gcm_1_3_oversized_record

Error Message:
/usr/src/tests/sys/kern/ktls_test.c:1587: errno == expected_error not met