FreeBSD-main-amd64-test - Build #22609 - Still Unstable

From: <>
Date: Fri, 09 Dec 2022 09:07:18 UTC
FreeBSD-main-amd64-test - Build #22609 (111610316e49dd6dc6b0b74455c1e4c81960faa8) - Still Unstable

Build information:
Full change log:
Full build log:

Status explanation:
"Unstable" - some tests are suspected being broken by the following changes
"Still Unstable" - the failing test cases have not been fixed by these
                   following changes and this is a notification to note that
                   these changes have not been fully tested by the CI system

Change summaries:
(Those commits are likely but not certainly responsible)

111610316e49dd6dc6b0b74455c1e4c81960faa8 by imp:
kboot: Allow loading fdt from different sources

The failed test cases:

3 tests failed.
FAILED:  sys.kern.ktls_test.ktls_receive_aes128_cbc_1_2_sha256_bad_major

Error Message:
/usr/src/tests/sys/kern/ktls_test.c:1587: errno == expected_error not met

FAILED:  sys.kern.ktls_test.ktls_receive_aes256_cbc_1_2_sha384_bad_minor

Error Message:
/usr/src/tests/sys/kern/ktls_test.c:1587: errno == expected_error not met

FAILED:  sys.netinet6.ndp.ndp_del_gu_success

Error Message:
atf-check failed; see the output of the test for details