FreeBSD-main-amd64-test - Build #22600 - Unstable

From: <>
Date: Wed, 07 Dec 2022 22:56:11 UTC
FreeBSD-main-amd64-test - Build #22600 (78ec1136175978785ffe3e0879fed646ae02838b) - Unstable

Build information:
Full change log:
Full build log:

Status explanation:
"Unstable" - some tests are suspected being broken by the following changes
"Still Unstable" - the failing test cases have not been fixed by these
                   following changes and this is a notification to note that
                   these changes have not been fully tested by the CI system

Change summaries:
(Those commits are likely but not certainly responsible)

e68b3792440cac248347afe08ba5881a00ba6523 by glebius:
tcp: embed inpcb into tcpcb

918fa4227d5bb74e882649785284c76e24e8f259 by glebius:
tcp: remove tcp_timer_suspend()

446ccdd08e2a9f704f6348cd7f679e59183b99b3 by glebius:
tcp: use single locked callout per tcpcb for the TCP timers

294a609fc07d5cf26ee430b0015d9846b81c8e5c by glebius:
udp: destroy UDP and UDP-Lite inpcbinfos in single SYSUNINIT

0c0d8a4f7e54fd4931cf23a6a68fca78a0d9aad9 by glebius:
udp: rearrange declarations in udp_var.h into user and _KERNEL halves

b11aebff4d4a301bfeac516b5be45080c8a11142 by imp:
kboot: Mark the EFI specific parts of bootinfo.c

288626083b6064a777ecfe1f64af06d658ef804c by imp:
kboot: copy EFI's bootinfo.c and adjust

299c64e316f026a9441775f21dfdb69e8125d58e by imp:
stand/kboot: Initialize all the devices

482380c6f8252228a172d82e74ef0964f8fc258b by imp:
stand/kboot: Remove unneeded include.

ed56dcfc6b1f4de2a5ae4f0f86dff5dfe0a5541c by imp:
boot: pass in args as const

667419d55313619807b07b1bff1b206fb5d9edbb by imp:
stand/efi: remove unused local varaibles

e1ff7945e1b3a9af34f092d9cca72ed802671c20 by imp:
stand/kboot: Parse the command line args

7014e78fb714f85fe91c611663fdfb937b96714e by imp:
boot: Remove stray free()

073ccb9d5553684590ef1ba4de3d5af77a53ee94 by sjg:
Allow site.*.mk to augment local.*.mk and src.*.mk

c24a6b32bb1c8911c94c05f13893f88ddd3bcba9 by dim:
Remove duplicated usr/bin/opieinfo line from

483fe96511ec02a3f077f9a59f1a96acb3640dea by glebius:
udp: embed inpcb into udpcb

32920f038a3a0f6778983e15228103e4da9c3007 by glebius:
udp: inline udp_output() into udp_send()

5bfc014f23452367c9ddcabc5a183b4ee975932d by glebius:
udp6: inline udp6_output() into udp6_send()

1aed3b34301e33eb8f64d7abc968fcbe5d6171ca by glebius:
udp: add protocol method declarations to udp_var.h

78ec1136175978785ffe3e0879fed646ae02838b by glebius:
tests/netinet: mark more tests that require python

The failed test cases:

4 tests failed.
FAILED:  sys.kern.ktls_test.ktls_receive_aes128_cbc_1_2_sha1_bad_major

Error Message:
/usr/src/tests/sys/kern/ktls_test.c:1511: errno == expected_error not met

FAILED:  sys.kern.ktls_test.ktls_receive_aes128_gcm_1_3_bad_major

Error Message:
/usr/src/tests/sys/kern/ktls_test.c:1511: errno == expected_error not met

FAILED:  sys.kern.ktls_test.ktls_receive_aes128_gcm_1_3_bad_minor

Error Message:
/usr/src/tests/sys/kern/ktls_test.c:1511: errno == expected_error not met

FAILED:  sys.netpfil.common.dummynet.pf_queue

Error Message:
We failed prioritisation 1 times